{"text_format":"1","workbook":"xlsx","n_sheets":2,"sheets":["Credit Card Summary","Data"],"not_rendered":{"charts":0,"images":1,"macros":1,"external_links":1,"defined_names":5,"comments":0,"pivot_tables":0},"unopened":[],"bounds":{"document_bytes":16777216,"sheet_cells":100000,"rows_first":2000,"rows_last":500,"rows_between":2000,"halvings":0,"cell_chars":16384,"cell_head_chars":4096},"cells_cut":0,"cells_raw":0,"read":"whole","date_system":"1900"}

{"sheet":"Credit Card Summary","index":0,"n_rows":59,"n_cols":22,"rows_kept":59,"cut":false,"hidden":false,"merged":[[7,0,7,8],[1,16,1,18],[1,14,1,15],[2,14,2,15],[3,14,3,15],[4,14,4,15],[5,14,5,15]]}
[]
[null,null,null,null,null,null,null,null,null,null,null,null,null,"Location / Academy Name:",null,null,{"$f":"IF(ISNA(VLOOKUP(O2,Data!A2:B35,2,FALSE))=TRUE,\"\",VLOOKUP(O2,Data!A2:B35,2,FALSE))","v":""}]
[null,null,null,null,null,null,null,null,null,null,null,null,null,"Document Period:",1,null,""]
[null,null,null,null,null,null,null,null,null,null,null,null,null,"Statement Date"]
[null,null,null,null,null,null,null,null,null,null,null,null,null,"Document Year:","2018/19"]
[null,null,null,null,null,null,null,null,null,null,null,null,null,"Statement Amount:"]
[]
[]
[]
[null,null,null,null,null,null,null,null,null,null,null,null,null,null,null,null,"Note: please use positive figures for expenditure"]
["DOC TYPE","ROW NUMBER","DOC DATE","DOCUMENT YEAR","DOCUMENT PERIOD","NOMINAL","ACCOUNT","VALUE","DESCRIPTION"]
[]
[]
[]
["EBGJ",3,{"$f":"IF($O$4=\"\",\"\",$O$4)","v":""},{"$f":"IF($O$5=\"\",\"\",$O$5)","v":"2018/19"},{"$f":"$O$3","v":1},{"$f":"O2&\"4010\"","v":"4010"},{"$f":"LEFT(Data!$AC$45,6)","v":"SLT001"},{"$f":"-$O$6","v":0},{"$f":"IF(H15=\"\",\"\",$O$2&\" Credit Card expense \"&Q15)","v":" Credit Card expense "},null,"Expenditure - Credit Card"]
["EBGJ",4,"","2018/19",1,{"$f":"IF(H15=\"\",\"\",\"EBO\"&\"9521\")","v":"EBO9521"},{"$f":"IF(F16=\"\",\"\",LEFT($O$5,4)&RIGHT($O$5,2)&\"M\"&$O$3)","v":"201819M1"},{"$f":"IF(G16=\"\",\"\",SUM(R57))","v":0},{"$f":"IF(H16=\"\",\"\",$O$2&\" Credit Card expense \"&Q15)","v":" Credit Card expense "},null,null,null,"Nominal Code",null,"Account Code",null,"Net","VAT","Gross","Description","Receipt Attached","Comments"]
["EBGJ",5,"","2018/19",{"$f":"$O$3","v":1},{"$f":"IF(M17=\"\",\"\",$O$2&M17)","v":""},{"$f":"IF(O17=\"\",\"\",O17)","v":""},{"$f":"IF(Q17=\"\",\"\",SUM(Q17))","v":""},{"$f":"IF(T17=\"\",\"\",T17)","v":""},null,null,1,null,{"$f":"IF(M17=\"\",\"\",IF(ISNA(VLOOKUP(M17,Data!R:S,2,FALSE))=TRUE,\"Does not exist, please check and re-enter\",VLOOKUP(M17,Data!R:S,2,FALSE)))","v":""},null,{"$f":"IF(O17=\"\",\"\",IF(ISNA(VLOOKUP(O17,Data!U:V,2,FALSE))=TRUE,\"Does not exist, please check and re-enter\",VLOOKUP(O17,Data!U:V,2,FALSE)))","v":""},null,null,{"$f":"IF(Q17=\"\",\"\",SUM(Q17:R17))","v":""}]
["EBGJ",6,"","2018/19",1,{"$f":"IF(M18=\"\",\"\",$O$2&M18)","v":""},{"$f":"IF(O18=\"\",\"\",O18)","v":""},{"$f":"IF(Q18=\"\",\"\",SUM(Q18))","v":""},{"$f":"IF(T18=\"\",\"\",T18)","v":""},null,null,2,null,{"$f":"IF(M18=\"\",\"\",IF(ISNA(VLOOKUP(M18,Data!R:S,2,FALSE))=TRUE,\"Does not exist, please check and re-enter\",VLOOKUP(M18,Data!R:S,2,FALSE)))","v":""},null,{"$f":"IF(O18=\"\",\"\",IF(ISNA(VLOOKUP(O18,Data!U:V,2,FALSE))=TRUE,\"Does not exist, please check and re-enter\",VLOOKUP(O18,Data!U:V,2,FALSE)))","v":""},null,null,{"$f":"IF(Q18=\"\",\"\",SUM(Q18:R18))","v":""}]
["EBGJ",7,"","2018/19",1,{"$f":"IF(M19=\"\",\"\",$O$2&M19)","v":""},{"$f":"IF(O19=\"\",\"\",O19)","v":""},{"$f":"IF(Q19=\"\",\"\",SUM(Q19))","v":""},{"$f":"IF(T19=\"\",\"\",T19)","v":""},null,null,3,null,{"$f":"IF(M19=\"\",\"\",IF(ISNA(VLOOKUP(M19,Data!R:S,2,FALSE))=TRUE,\"Does not exist, please check and re-enter\",VLOOKUP(M19,Data!R:S,2,FALSE)))","v":""},null,{"$f":"IF(O19=\"\",\"\",IF(ISNA(VLOOKUP(O19,Data!U:V,2,FALSE))=TRUE,\"Does not exist, please check and re-enter\",VLOOKUP(O19,Data!U:V,2,FALSE)))","v":""},null,null,""]
["EBGJ",8,"","2018/19",1,"","","","",null,null,4,null,{"$f":"IF(M20=\"\",\"\",IF(ISNA(VLOOKUP(M20,Data!R:S,2,FALSE))=TRUE,\"Does not exist, please check and re-enter\",VLOOKUP(M20,Data!R:S,2,FALSE)))","v":""},null,{"$f":"IF(O20=\"\",\"\",IF(ISNA(VLOOKUP(O20,Data!U:V,2,FALSE))=TRUE,\"Does not exist, please check and re-enter\",VLOOKUP(O20,Data!U:V,2,FALSE)))","v":""},null,null,""]
{"$rows_left_out":40}
{"sheet":"Data","index":1,"n_rows":414,"n_cols":32,"rows_kept":414,"cut":false,"hidden":true,"merged":[[0,0,0,1],[0,3,0,5],[0,17,0,18],[0,20,0,21]]}
["Location Codes",null,null,"Period",null,null,null,"Group","Code","Description","Count","Secruity","Approver 1\n£0.00\nto\n£1000.00","Approver 2\n£1000.01\nto\n£10000.00","Approver 3\n£10000.01\nto\n£50,000","Approver 4\n£50000.01\nto\ninfinity",null,"New Nominal",null,null,"New Account",null,null,"New Nominal",null,null,null,null,"New Account"]
[null,null,null,"Fin. Period","Calendar Mth"]
["ACS","Alderman Cogan's Church of England Primary Academy",null,9,"01","September",null,"ADMIN","ADM001","Administration",{"$f":"COUNTIF(I:I,I3)","v":1},"A_ADMIN","Headteacher","Executive Headteacher","FD","CEO",null,1000,"GAG Funding Pupil Lead",null,"ASC001","After School Club",null,"1000 - GAG Funding Pupil Lead",{"$f":"--ISNUMBER(IFERROR(SEARCH(#REF!,X3,1),\"\"))","v":0},{"$f":"IF(Y3=1,COUNTIF(Y$3:$Y3,1),\"\")","v":""},{"$f":"IFERROR(INDEX($X$3:$X$274,MATCH(ROWS(Z$3:$Z3),$Z$3:$Z$274,0)),\"\")","v":"1081 - Pupil Premium"},null,{"$f":"$I5&\" - \"&$J5","v":"ASC001 - After School Club"},1,{"$f":"IF(AD3=1,COUNTIF($AD$3:AD3,1),\"\")","v":1},{"$f":"IFERROR(INDEX($AC$3:$AC$53,MATCH(ROWS($AE$3:AE3),$AE$3:$AE$55,0)),\"\")","v":"ASC001 - After School Club"}]
["BBS","Brotherton and Byram Primary Academy",null,10,"02","October",null,"CURR","ART001","Art",{"$f":"COUNTIF(I:I,I4)","v":1},{"$f":"\"A_\"&MID(I4,1,3)","v":"A_ART"},"Headteacher","Executive Headteacher","FD","CEO",null,1001,"Educational Services Grant",null,"BRE001","Breakfast Club",null,"1001 - Educational Services Grant",{"$f":"--ISNUMBER(IFERROR(SEARCH(#REF!,X4,1),\"\"))","v":0},{"$f":"IF(Y4=1,COUNTIF(Y$3:$Y4,1),\"\")","v":""},{"$f":"IFERROR(INDEX($X$3:$X$274,MATCH(ROWS(Z$3:$Z4),$Z$3:$Z$274,0)),\"\")","v":"1083 - Start Up Grant (A)"},null,{"$f":"$I8&\" - \"&$J8","v":"BRE001 - Breakfast Club"},1,{"$f":"IF(AD4=1,COUNTIF($AD$3:AD4,1),\"\")","v":2},{"$f":"IFERROR(INDEX($AC$3:$AC$53,MATCH(ROWS($AE$3:AE4),$AE$3:$AE$55,0)),\"\")","v":"BRE001 - Breakfast Club"}]
["CAM","Camblesforth Community Primary Academy",null,11,"03","November",null,"WAC","ASC001","After School Club",{"$f":"COUNTIF(I:I,I5)","v":1},"A_WAC","Headteacher","Executive Headteacher","FD","CEO",null,1002,"High Needs Funding",null,"CAT001","Catering",null,"1002 - High Needs Funding",{"$f":"--ISNUMBER(IFERROR(SEARCH(#REF!,X5,1),\"\"))","v":0},{"$f":"IF(Y5=1,COUNTIF(Y$3:$Y5,1),\"\")","v":""},{"$f":"IFERROR(INDEX($X$3:$X$274,MATCH(ROWS(Z$3:$Z5),$Z$3:$Z$274,0)),\"\")","v":"1101 - Breakfast Club"},null,{"$f":"$I11&\" - \"&$J11","v":"CAT001 - Catering"},{"$f":"--ISNUMBER(IFERROR(SEARCH(#REF!,AC3,1),\"\"))","v":0},{"$f":"IF(AD5=1,COUNTIF($AD$3:AD5,1),\"\")","v":""},{"$f":"IFERROR(INDEX($AC$3:$AC$53,MATCH(ROWS($AE$3:AE5),$AE$3:$AE$55,0)),\"\")","v":"CPD001 - Staff Development"}]
["EAS","Easington CE Primary Academy",null,12,"04","December",null,"CURR","ASS001","Assessment",{"$f":"COUNTIF(I:I,I6)","v":1},"A_WAC","Headteacher","Executive Headteacher","FD","CEO",null,1004,"Infant Class Size Funding",null,"CPD001","Staff Development",null,"1004 - Infant Class Size Funding",{"$f":"--ISNUMBER(IFERROR(SEARCH(#REF!,X6,1),\"\"))","v":0},{"$f":"IF(Y6=1,COUNTIF(Y$3:$Y6,1),\"\")","v":""},{"$f":"IFERROR(INDEX($X$3:$X$274,MATCH(ROWS(Z$3:$Z6),$Z$3:$Z$274,0)),\"\")","v":"1115 - Staff Consultancy / Recharges"},null,"CPD001 - Staff Development",1,{"$f":"IF(AD6=1,COUNTIF($AD$3:AD6,1),\"\")","v":3},{"$f":"IFERROR(INDEX($AC$3:$AC$53,MATCH(ROWS($AE$3:AE6),$AE$3:$AE$55,0)),\"\")","v":"EMS001 - Enhanced Mainstream School"}]
["EBO","Ebor Academy Trust",null,1,"05","January",null,"CURR","BEH001","Behaviour Support",{"$f":"COUNTIF(I:I,I7)","v":1},"A_WAC","Headteacher","Executive Headteacher","FD","CEO",null,1005,"Free School Meal Funding",null,"EMS001","Enhanced Mainstream School",null,"1005 - Free School Meals",{"$f":"--ISNUMBER(IFERROR(SEARCH(#REF!,X7,1),\"\"))","v":0},{"$f":"IF(Y7=1,COUNTIF(Y$3:$Y7,1),\"\")","v":""},{"$f":"IFERROR(INDEX($X$3:$X$274,MATCH(ROWS(Z$3:$Z7),$Z$3:$Z$274,0)),\"\")","v":"1140 - Uniforms Income"},null,{"$f":"$I16&\" - \"&$J16","v":"EMS001 - Enhanced Mainstream School"},1,{"$f":"IF(AD7=1,COUNTIF($AD$3:AD7,1),\"\")","v":4},{"$f":"IFERROR(INDEX($AC$3:$AC$53,MATCH(ROWS($AE$3:AE7),$AE$3:$AE$55,0)),\"\")","v":"KS1001 - KS1"}]
["FIS","Filey CoE Nursery and Infants Academy",null,2,"06","February",null,"WAC","BRE001","Breakfast Club",1,"A_WAC","Headteacher","Executive Headteacher","FD","CEO",null,1006,"RPA Contribution",null,"EYR001","Early Years",null,"1006 - RPA Contribution",{"$f":"--ISNUMBER(IFERROR(SEARCH(#REF!,X8,1),\"\"))","v":0},{"$f":"IF(Y8=1,COUNTIF(Y$3:$Y8,1),\"\")","v":""},{"$f":"IFERROR(INDEX($X$3:$X$274,MATCH(ROWS(Z$3:$Z8),$Z$3:$Z$274,0)),\"\")","v":"1150 - Sponsor Income"},null,{"$f":"$I19&\" - \"&$J19","v":"EYR001 - Early Years"},{"$f":"--ISNUMBER(IFERROR(SEARCH(#REF!,AC4,1),\"\"))","v":0},{"$f":"IF(AD8=1,COUNTIF($AD$3:AD8,1),\"\")","v":""},{"$f":"IFERROR(INDEX($AC$3:$AC$53,MATCH(ROWS($AE$3:AE8),$AE$3:$AE$55,0)),\"\")","v":"KS2001 - Lower KS2"}]
["FLY","Ebor Academy Filey",null,3,"07","March",null,"CURR","BUS001","Business Studies",1,{"$f":"\"A_\"&MID(I9,1,3)","v":"A_BUS"},"Headteacher","Executive Headteacher","FD","CEO",null,1007,"Minimum Funding Guarantee",null,"KS1001","KS1",null,"1007 - Minimum Funding Guarantee",{"$f":"--ISNUMBER(IFERROR(SEARCH(#REF!,X9,1),\"\"))","v":0},{"$f":"IF(Y9=1,COUNTIF(Y$3:$Y9,1),\"\")","v":""},{"$f":"IFERROR(INDEX($X$3:$X$274,MATCH(ROWS(Z$3:$Z9),$Z$3:$Z$274,0)),\"\")","v":"1160 - School Direct"},null,{"$f":"$I26&\" - \"&$J26","v":"KS1001 - KS1"},1,{"$f":"IF(AD9=1,COUNTIF($AD$3:AD9,1),\"\")","v":5},{"$f":"IFERROR(INDEX($AC$3:$AC$53,MATCH(ROWS($AE$3:AE9),$AE$3:$AE$55,0)),\"\")","v":"ICT001 - IT"}]
["HMO","Hob Moor Oaks Academy",null,4,"08","April",null,"CAP","CAP001","Capital",1,"A_CAP","Headteacher","Executive Headteacher","FD","CEO",null,1008,"Lump Sum Funding",null,"KS2001","Lower KS2",null,"1008 - Lump Sum Funding",{"$f":"--ISNUMBER(IFERROR(SEARCH(#REF!,X10,1),\"\"))","v":0},{"$f":"IF(Y10=1,COUNTIF(Y$3:$Y10,1),\"\")","v":""},{"$f":"IFERROR(INDEX($X$3:$X$274,MATCH(ROWS(Z$3:$Z10),$Z$3:$Z$274,0)),\"\")","v":"3401 - Business Rates"},null,{"$f":"$I27&\" - \"&$J27","v":"KS2001 - Lower KS2"},1,{"$f":"IF(AD10=1,COUNTIF($AD$3:AD10,1),\"\")","v":6},{"$f":"IFERROR(INDEX($AC$3:$AC$53,MATCH(ROWS($AE$3:AE10),$AE$3:$AE$55,0)),\"\")","v":"NUR001 - Nursery / Preschool"}]
["HMS","Hob Moor Primary Academy",null,5,"09","May",null,"CAT","CAT001","Catering",1,"A_CAT","Headteacher","Executive Headteacher","FD","CEO",null,1051,"PE Grant",null,"KS2002","Upper KS2",null,"1051 - PE Grant",{"$f":"--ISNUMBER(IFERROR(SEARCH(#REF!,X11,1),\"\"))","v":0},{"$f":"IF(Y11=1,COUNTIF(Y$3:$Y11,1),\"\")","v":""},{"$f":"IFERROR(INDEX($X$3:$X$274,MATCH(ROWS(Z$3:$Z11),$Z$3:$Z$274,0)),\"\")","v":"3402 - Rent"},null,{"$f":"$I28&\" - \"&$J28","v":"KS2002 - Upper KS2"},{"$f":"--ISNUMBER(IFERROR(SEARCH(#REF!,AC5,1),\"\"))","v":0},{"$f":"IF(AD11=1,COUNTIF($AD$3:AD11,1),\"\")","v":""},{"$f":"IFERROR(INDEX($AC$3:$AC$53,MATCH(ROWS($AE$3:AE11),$AE$3:$AE$55,0)),\"\")","v":"PPR001 - Pupil Premium"}]
["HRS","Haxby Road Primary Academy",null,6,"10","June",null,"CURR","COO001","Cook School",1,{"$f":"\"A_\"&MID(I12,1,3)","v":"A_COO"},"Headteacher","Executive Headteacher","FD","CEO",null,1052,"School Improvement",null,"ICT001","Information Technology",null,"1052 - School Improvement",{"$f":"--ISNUMBER(IFERROR(SEARCH(#REF!,X12,1),\"\"))","v":0},{"$f":"IF(Y12=1,COUNTIF(Y$3:$Y12,1),\"\")","v":""},{"$f":"IFERROR(INDEX($X$3:$X$274,MATCH(ROWS(Z$3:$Z12),$Z$3:$Z$274,0)),\"\")","v":"3600 - Security Patrol"},null,{"$f":"$I25&\" - \"&$J25","v":"ICT001 - IT"},1,{"$f":"IF(AD12=1,COUNTIF($AD$3:AD12,1),\"\")","v":7},{"$f":"IFERROR(INDEX($AC$3:$AC$53,MATCH(ROWS($AE$3:AE12),$AE$3:$AE$55,0)),\"\")","v":"SCH001 - Main School"}]
["LAK","Lakeside Primary School",null,7,"11","July",null,"CURR","DAT001","Design and Technology",1,"A_DAT","Headteacher","Executive Headteacher","FD","CEO",null,1081,"Pupil Premium",null,"NQT001","Newly Qualified Teachers",null,"1081 - Pupil Premium",1,{"$f":"IF(Y13=1,COUNTIF(Y$3:$Y13,1),\"\")","v":1},{"$f":"IFERROR(INDEX($X$3:$X$274,MATCH(ROWS(Z$3:$Z13),$Z$3:$Z$274,0)),\"\")","v":"4010 - Capitation"},null,{"$f":"$I35&\" - \"&$J35","v":"NQT001 - Newly Qualified Teachers"},{"$f":"--ISNUMBER(IFERROR(SEARCH(#REF!,AC6,1),\"\"))","v":0},{"$f":"IF(AD13=1,COUNTIF($AD$3:AD13,1),\"\")","v":""},{"$f":"IFERROR(INDEX($AC$3:$AC$53,MATCH(ROWS($AE$3:AE13),$AE$3:$AE$55,0)),\"\")","v":"SDW001 - Schools Direct"}]
["MAR","Marfleet Primary School",null,8,"12","August",null,"CURR","DRA001","Drama",1,"A_DRA","Headteacher","Executive Headteacher","FD","CEO",null,1083,"Start Up Grant (A)",null,"NUR001","Nursery / Preschool (3&4 Year Olds)",null,"1083 - Start Up Grant (A)",1,{"$f":"IF(Y14=1,COUNTIF(Y$3:$Y14,1),\"\")","v":2},{"$f":"IFERROR(INDEX($X$3:$X$274,MATCH(ROWS(Z$3:$Z14),$Z$3:$Z$274,0)),\"\")","v":"4150 - Examination Fees"},null,{"$f":"$I38&\" - \"&$J38","v":"NUR001 - Nursery / Preschool"},1,{"$f":"IF(AD14=1,COUNTIF($AD$3:AD14,1),\"\")","v":8},{"$f":"IFERROR(INDEX($AC$3:$AC$53,MATCH(ROWS($AE$3:AE14),$AE$3:$AE$55,0)),\"\")","v":"TRP001 - School Trips"}]
["OSB","Osbaldwick Primary School",null,null,null,null,null,"CURR","DUK001","Duke of Edinburgh Award Scheme",1,"A_DUK","Headteacher","Executive Headteacher","FD","CEO",null,1084,"Start Up Grant (B)",null,"PEG001","PE Grant",null,"1084 - Start Up Grant (B)",{"$f":"--ISNUMBER(IFERROR(SEARCH(#REF!,X13,1),\"\"))","v":0},{"$f":"IF(Y15=1,COUNTIF(Y$3:$Y15,1),\"\")","v":""},{"$f":"IFERROR(INDEX($X$3:$X$274,MATCH(ROWS(Z$3:$Z15),$Z$3:$Z$274,0)),\"\")","v":"5013 - Catering (School Meals)"},null,"PEG001 - PE Grant",{"$f":"--ISNUMBER(IFERROR(SEARCH(#REF!,AC15,1),\"\"))","v":0},{"$f":"IF(AD15=1,COUNTIF($AD$3:AD15,1),\"\")","v":""},{"$f":"IFERROR(INDEX($AC$3:$AC$53,MATCH(ROWS($AE$3:AE15),$AE$3:$AE$55,0)),\"\")","v":"ENG001 - English"}]
["PAT","Patrington CE Primary Academy",null,"Date","Fin. Period","Calendar Mth",null,"CURR","EMS001","Enhanced Mainstream School",1,"A_EMS","Headteacher","Executive Headteacher","FD","CEO",null,1087,"Other ESFA Grants",null,"PPR001","Pupil Premium",null,"1087 - Other ESFA Grants",{"$f":"--ISNUMBER(IFERROR(SEARCH(#REF!,X16,1),\"\"))","v":0},{"$f":"IF(Y16=1,COUNTIF(Y$3:$Y16,1),\"\")","v":""},{"$f":"IFERROR(INDEX($X$3:$X$274,MATCH(ROWS(Z$3:$Z16),$Z$3:$Z$274,0)),\"\")","v":"5015 - Catering Supplies"},null,{"$f":"$I42&\" - \"&$J42","v":"PPR001 - Pupil Premium"},1,{"$f":"IF(AD16=1,COUNTIF($AD$3:AD16,1),\"\")","v":9},{"$f":"IFERROR(INDEX($AC$3:$AC$53,MATCH(ROWS($AE$3:AE16),$AE$3:$AE$55,0)),\"\")","v":"HIS001 - History"}]
["PGS","Park Grove Primary Academy",null,"2018-07-31",{"$f":"VLOOKUP(F17,$D$3:$E$14,2,FALSE)","v":"11"},{"$f":"MONTH(D17)","v":7},null,"CURR","ENG001","English",1,"A_ENG","Headteacher","Executive Headteacher","FD","CEO",null,1095,"SEN",null,"PRE001","Premises",null,"1095 - SEN",{"$f":"--ISNUMBER(IFERROR(SEARCH(#REF!,X14,1),\"\"))","v":0},{"$f":"IF(Y17=1,COUNTIF(Y$3:$Y17,1),\"\")","v":""},{"$f":"IFERROR(INDEX($X$3:$X$274,MATCH(ROWS(Z$3:$Z17),$Z$3:$Z$274,0)),\"\")","v":"5105 - Mobile Communications"},null,{"$f":"$I41&\" - \"&$J41","v":"PRE001 - Premises"},{"$f":"--ISNUMBER(IFERROR(SEARCH(#REF!,AC7,1),\"\"))","v":0},{"$f":"IF(AD17=1,COUNTIF($AD$3:AD17,1),\"\")","v":""},{"$f":"IFERROR(INDEX($AC$3:$AC$53,MATCH(ROWS($AE$3:AE17),$AE$3:$AE$55,0)),\"\")","v":"MAT001 - Mathematics"}]
["RWS","Robert Wilkinson Primary Academy",null,"2018-08-01",{"$f":"VLOOKUP(F18,$D$3:$E$14,2,FALSE)","v":"12"},{"$f":"MONTH(D18)","v":8},null,"CURR","ERP001","ERP",1,"A_ERP","Headteacher","Executive Headteacher","FD","CEO",null,1097,"Other LA Grants",null,"SCH001","Main School",null,"1097 - Other LA Grants",{"$f":"--ISNUMBER(IFERROR(SEARCH(#REF!,X15,1),\"\"))","v":0},{"$f":"IF(Y18=1,COUNTIF(Y$3:$Y18,1),\"\")","v":""},{"$f":"IFERROR(INDEX($X$3:$X$274,MATCH(ROWS(Z$3:$Z18),$Z$3:$Z$274,0)),\"\")","v":"5112 - IT Hardware"},null,{"$f":"$I44&\" - \"&$J44","v":"SCH001 - Main School"},1,{"$f":"IF(AD18=1,COUNTIF($AD$3:AD18,1),\"\")","v":10},{"$f":"IFERROR(INDEX($AC$3:$AC$53,MATCH(ROWS($AE$3:AE18),$AE$3:$AE$55,0)),\"\")","v":""}]
["SHS","Staynor Hall Community Primary Academy",null,"2018-08-02",{"$f":"VLOOKUP(F19,$D$3:$E$14,2,FALSE)","v":"12"},{"$f":"MONTH(D19)","v":8},null,"CURR","EYR001","Early Years",1,"A_EYR","Headteacher","Executive Headteacher","FD","CEO",null,1100,"Donations and / or Voluntary Funds",null,"SDW001","Schools Direct",null,"1100 - Donations and / or Voluntary Funds",{"$f":"--ISNUMBER(IFERROR(SEARCH(#REF!,X17,1),\"\"))","v":0},{"$f":"IF(Y19=1,COUNTIF(Y$3:$Y19,1),\"\")","v":""},{"$f":"IFERROR(INDEX($X$3:$X$274,MATCH(ROWS(Z$3:$Z19),$Z$3:$Z$274,0)),\"\")","v":"5113 - IT Software and Licences"},null,{"$f":"$I47&\" - \"&$J47","v":"SDW001 - Schools Direct"},1,{"$f":"IF(AD19=1,COUNTIF($AD$3:AD19,1),\"\")","v":11},{"$f":"IFERROR(INDEX($AC$3:$AC$53,MATCH(ROWS($AE$3:AE19),$AE$3:$AE$55,0)),\"\")","v":""}]
["SIG","Sigglesthorne CofE Primary Academy",null,"2018-08-03",{"$f":"VLOOKUP(F20,$D$3:$E$14,2,FALSE)","v":"12"},{"$f":"MONTH(D20)","v":8},null,"CURR","FOT001","Food Technology",1,"A_FOT","Headteacher","Executive Headteacher","FD","CEO",null,1101,"Breakfast Club",null,"SEN001","SEN",null,"1101 - Breakfast Club",1,{"$f":"IF(Y20=1,COUNTIF(Y$3:$Y20,1),\"\")","v":3},{"$f":"IFERROR(INDEX($X$3:$X$274,MATCH(ROWS(Z$3:$Z20),$Z$3:$Z$274,0)),\"\")","v":"5206 - Stationery"},null,{"$f":"$I48&\" - \"&$J48","v":"SEN001 - SEN"},{"$f":"--ISNUMBER(IFERROR(SEARCH(#REF!,AC8,1),\"\"))","v":0},{"$f":"IF(AD20=1,COUNTIF($AD$3:AD20,1),\"\")","v":""},{"$f":"IFERROR(INDEX($AC$3:$AC$53,MATCH(ROWS($AE$3:AE20),$AE$3:$AE$55,0)),\"\")","v":""}]
{"$rows_left_out":394}