{"text_format":"1","workbook":"xlsx","n_sheets":6,"sheets":["Instructions","Cash & Cheque Income","ParentPay Income","PayPoint Income","Credit Card Summary","Data"],"not_rendered":{"charts":0,"images":5,"macros":1,"external_links":1,"defined_names":8,"comments":0,"pivot_tables":0},"unopened":[],"bounds":{"document_bytes":16777216,"sheet_cells":100000,"rows_first":2000,"rows_last":500,"rows_between":2000,"halvings":0,"cell_chars":16384,"cell_head_chars":4096},"cells_cut":0,"cells_raw":0,"read":"whole","date_system":"1900"}

{"sheet":"Instructions","index":0,"n_rows":50,"n_cols":3,"rows_kept":50,"cut":false,"hidden":false,"merged":[[7,1,9,27],[49,1,51,27]]}
["Income Record Instructions"]
[]
[null,"Included below are instructions for:"]
[null,null,"1) Cash & Cheque income"]
[null,null,"2) ParentPay and PayPoint income"]
[null,"1) Cash & Cheque Income"]
[]
[null,"Please follow the following instructions when completing the Income Record form. \nInformation should be completed in the format requested, where applicable, as informtion included on this form is used to automatically upload the data into PSF.  All green cells should be completed, except where there is insufficient information to do so i.e. there are less than 15 lines of income on a paying slip to be recorded.\nA single Income Record should be completed for each school in any given month, showing all Cash / Cheques received, recorded per paying in slip, as appropriate and all ParentPay and PayPoint Information."]
[]
[]
[]
[]
[]
[]
[]
{"$rows_left_out":36}
{"sheet":"Cash & Cheque Income","index":1,"n_rows":132,"n_cols":21,"rows_kept":132,"cut":false,"hidden":false,"merged":[[7,0,7,8],[1,14,1,15],[2,14,2,15],[3,14,3,15],[4,14,4,15],[1,16,1,18],[114,16,114,17],[14,16,14,17],[94,16,94,17],[74,16,74,17],[54,16,54,17],[34,16,34,17]]}
[]
[null,null,null,null,null,null,null,null,null,null,null,null,null,"Location / Academy Name:",null,null,{"$f":"IF(ISNA(VLOOKUP(O2,Data!A2:B35,2,FALSE))=TRUE,\"\",VLOOKUP(O2,Data!A2:B35,2,FALSE))","v":""}]
[null,null,null,null,null,null,null,null,null,null,null,null,null,"Document Period:",{"$f":"IF(O4=\"\",\"\",VLOOKUP(O4,Data!$D$17:$F$414,2,FALSE))","v":""},null,""]
[null,null,null,null,null,null,null,null,null,null,null,null,null,"Period End Date:"]
[null,null,null,null,null,null,null,null,null,null,null,null,null,"Document Year:","2017/18",null,null,null,null,"Note: please use negative figures for income"]
[]
[null,null,null,null,null,null,null,null,null,null,null,null,null,null,"Code Search"]
["JOURNAL UPLOAD DETAILS",null,null,null,null,null,null,null,null,null,null,null,null,null,"Nominal Code",""]
[null,null,null,null,null,null,null,null,null,null,null,null,null,null,"Account Code",""]
[]
["DOC TYPE","ROW NUMBER","DOC DATE","DOCUMENT YEAR","DOCUMENT PERIOD","NOMINAL","ACCOUNT","VALUE","DESCRIPTION"]
[]
["EBGJ",1,{"$f":"IF($O$4=\"\",\"\",$O$4)","v":""},{"$f":"IF($O$5=\"\",\"\",$O$5)","v":"2017/18"},{"$f":"$O$3","v":""},{"$f":"IF(H13=\"\",\"\",\"EBO\"&\"9400\")","v":""},null,{"$f":"IF(M17=\"\",\"\",-SUM(S32))","v":""},{"$f":"IF(H13=\"\",\"\",$O$2&\" Income \"&Q15)","v":""}]
["EBGJ",2,{"$f":"IF($O$4=\"\",\"\",$O$4)","v":""},{"$f":"IF($O$5=\"\",\"\",$O$5)","v":"2017/18"},"",{"$f":"IF(H13=\"\",\"\",\"EBO\"&\"9425\")","v":""},{"$f":"IF(F14=\"\",\"\",\"B_BFWD\")","v":""},{"$f":"IF(G14=\"\",\"\",SUM(Q32))","v":""},{"$f":"IF(H14=\"\",\"\",$O$2&\" Income \"&Q15)","v":""}]
["EBGJ",3,"","2017/18","",{"$f":"IF(H13=\"\",\"\",\"EBO\"&\"9425\")","v":""},{"$f":"IF(F15=\"\",\"\",\"B_BFWD\")","v":""},{"$f":"IF(G15=\"\",\"\",-SUM(Q32))","v":""},{"$f":"IF(H15=\"\",\"\",$O$2&\" Income \"&Q15)","v":""},null,"Income - Cash / Cheques (No. 1):",null,null,null,null,"Paying In Number:"]
{"$rows_left_out":118}
{"sheet":"ParentPay Income","index":2,"n_rows":145,"n_cols":21,"rows_kept":145,"cut":false,"hidden":false,"merged":[[121,16,121,17],[13,16,13,17],[39,16,39,17],[40,16,40,17],[66,16,66,17],[67,16,67,17],[7,0,7,8],[93,16,93,17],[12,16,12,17],[94,16,94,17],[120,16,120,17],[1,16,1,18],[1,14,1,15],[2,14,2,15],[3,14,3,15],[4,14,4,15]]}
[]
[null,null,null,null,null,null,null,null,null,null,null,null,null,"Location / Academy Name:",null,null,{"$f":"IF(ISNA(VLOOKUP(O2,Data!A2:B35,2,FALSE))=TRUE,\"\",VLOOKUP(O2,Data!A2:B35,2,FALSE))","v":""}]
[null,null,null,null,null,null,null,null,null,null,null,null,null,"Document Period:",{"$f":"IF(O4=\"\",\"\",VLOOKUP(O4,Data!$D$17:$F$414,2,FALSE))","v":""},null,""]
[null,null,null,null,null,null,null,null,null,null,null,null,null,"Period End Date:"]
[null,null,null,null,null,null,null,null,null,null,null,null,null,"Document Year:","2017/18"]
[]
[]
[]
[]
[null,null,null,null,null,null,null,null,null,null,null,null,null,null,null,null,"Note: please use negative figures for income"]
["DOC TYPE","ROW NUMBER","DOC DATE","DOCUMENT YEAR","DOCUMENT PERIOD","NOMINAL","ACCOUNT","VALUE","DESCRIPTION"]
[]
["EBGJ",1,{"$f":"IF($O$4=\"\",\"\",$O$4)","v":""},{"$f":"IF($O$5=\"\",\"\",$O$5)","v":"2017/18"},{"$f":"$O$3","v":""},{"$f":"IF(H13=\"\",\"\",\"EBO\"&\"9400\")","v":""},null,{"$f":"IF(Q17=\"\",\"\",-SUM(S37))","v":""},{"$f":"IF(H13=\"\",\"\",\"ParentPay \"&Q13&\"-\"&Q14)","v":""},null,"ParentPay (Week1 ):",null,null,null,null,"Date From:"]
["EBGJ",2,{"$f":"IF($O$4=\"\",\"\",$O$4)","v":""},{"$f":"IF($O$5=\"\",\"\",$O$5)","v":"2017/18"},{"$f":"$O$3","v":""},{"$f":"IF(H13=\"\",\"\",\"EBO\"&\"9425\")","v":""},{"$f":"IF(F14=\"\",\"\",\"B_BFWD\")","v":""},{"$f":"IF(G14=\"\",\"\",SUM(Q37))","v":""},{"$f":"IF(H14=\"\",\"\",\"ParentPay \"&Q13&\"-\"&Q14)","v":""},null,null,null,null,null,null,"Date To:"]
["EBGJ",3,"","2017/18",{"$f":"$O$3","v":""},{"$f":"IF(H13=\"\",\"\",\"EBO\"&\"9425\")","v":""},{"$f":"IF(F15=\"\",\"\",\"B_BFWD\")","v":""},{"$f":"IF(G15=\"\",\"\",-SUM(Q37))","v":""},{"$f":"IF(H15=\"\",\"\",\"ParentPay \"&Q13&\"-\"&Q14)","v":""}]
{"$rows_left_out":131}
{"sheet":"PayPoint Income","index":3,"n_rows":145,"n_cols":21,"rows_kept":145,"cut":false,"hidden":false,"merged":[[67,16,67,17],[93,16,93,17],[94,16,94,17],[120,16,120,17],[121,16,121,17],[7,0,7,8],[12,16,12,17],[39,16,39,17],[40,16,40,17],[66,16,66,17],[13,16,13,17],[1,16,1,18],[1,14,1,15],[2,14,2,15],[3,14,3,15],[4,14,4,15]]}
[]
[null,null,null,null,null,null,null,null,null,null,null,null,null,"Location / Academy Name:",null,null,{"$f":"IF(ISNA(VLOOKUP(O2,Data!A2:B35,2,FALSE))=TRUE,\"\",VLOOKUP(O2,Data!A2:B35,2,FALSE))","v":""}]
[null,null,null,null,null,null,null,null,null,null,null,null,null,"Document Period:",{"$f":"IF(O4=\"\",\"\",VLOOKUP(O4,Data!$D$17:$F$414,2,FALSE))","v":""},null,""]
[null,null,null,null,null,null,null,null,null,null,null,null,null,"Period End Date:"]
[null,null,null,null,null,null,null,null,null,null,null,null,null,"Document Year:","2017/18"]
[]
[]
[]
[]
[null,null,null,null,null,null,null,null,null,null,null,null,null,null,null,null,"Note: please use negative figures for income"]
["DOC TYPE","ROW NUMBER","DOC DATE","DOCUMENT YEAR","DOCUMENT PERIOD","NOMINAL","ACCOUNT","VALUE","DESCRIPTION"]
[]
["EBGJ",213,{"$f":"IF($O$4=\"\",\"\",$O$4)","v":""},{"$f":"$O$5","v":"2017/18"},{"$f":"$O$3","v":""},{"$f":"IF(H13=\"\",\"\",\"EBO\"&\"9400\")","v":""},null,{"$f":"IF(Q17=\"\",\"\",-SUM(S37))","v":""},{"$f":"IF(H13=\"\",\"\",\"PayPoint PP \"&Q13&\"-\"&Q14)","v":""},null,"PayPoint (Week 1):",null,null,null,null,"Date From:"]
["EBGJ",214,"","2017/18","",{"$f":"IF(H13=\"\",\"\",\"EBO\"&\"9425\")","v":""},{"$f":"IF(F14=\"\",\"\",\"B_BFWD\")","v":""},{"$f":"IF(G14=\"\",\"\",SUM(Q37))","v":""},{"$f":"IF(H14=\"\",\"\",\"PayPoint PP \"&Q13&\"-\"&Q14)","v":""},null,null,null,null,null,null,"Date To:"]
["EBGJ",215,"","2017/18","",{"$f":"IF(H13=\"\",\"\",\"EBO\"&\"9425\")","v":""},{"$f":"IF(F15=\"\",\"\",\"B_BFWD\")","v":""},{"$f":"IF(G15=\"\",\"\",-SUM(Q37))","v":""},{"$f":"IF(H15=\"\",\"\",\"PayPoint PP \"&Q13&\"-\"&Q14)","v":""}]
{"$rows_left_out":131}
{"sheet":"Credit Card Summary","index":4,"n_rows":57,"n_cols":22,"rows_kept":57,"cut":false,"hidden":false,"merged":[[7,0,7,8],[1,16,1,18],[1,14,1,15],[2,14,2,15],[3,14,3,15],[4,14,4,15]]}
[]
[null,null,null,null,null,null,null,null,null,null,null,null,null,"Location / Academy Name:",null,null,{"$f":"IF(ISNA(VLOOKUP(O2,Data!A2:B35,2,FALSE))=TRUE,\"\",VLOOKUP(O2,Data!A2:B35,2,FALSE))","v":""}]
[null,null,null,null,null,null,null,null,null,null,null,null,null,"Document Period:",{"$f":"IF(O4=\"\",\"\",VLOOKUP(O4,Data!$D$17:$F$414,2,FALSE))","v":""},null,""]
[null,null,null,null,null,null,null,null,null,null,null,null,null,"Statement Date"]
[null,null,null,null,null,null,null,null,null,null,null,null,null,"Document Year:","2017/18"]
[]
[]
[]
[]
[null,null,null,null,null,null,null,null,null,null,null,null,null,null,null,null,"Note: please use positive figures for expenditure"]
["DOC TYPE","ROW NUMBER","DOC DATE","DOCUMENT YEAR","DOCUMENT PERIOD","NOMINAL","ACCOUNT","VALUE","DESCRIPTION"]
[]
["EBGJ",1,{"$f":"IF($O$4=\"\",\"\",$O$4)","v":""},{"$f":"IF($O$5=\"\",\"\",$O$5)","v":"2017/18"},{"$f":"$O$3","v":""},{"$f":"IF(H13=\"\",\"\",\"EBO\"&\"9400\")","v":""},null,{"$f":"IF(M17=\"\",\"\",-SUM(S57))","v":""},{"$f":"IF(H13=\"\",\"\",$O$2&\" Credit Card expense \"&Q15)","v":""}]
["EBGJ",2,{"$f":"IF($O$4=\"\",\"\",$O$4)","v":""},{"$f":"IF($O$5=\"\",\"\",$O$5)","v":"2017/18"},{"$f":"$O$3","v":""},{"$f":"IF(H13=\"\",\"\",\"EBO\"&\"9410\")","v":""},{"$f":"IF(F14=\"\",\"\",VLOOKUP(O2,Data!$A$38:$B$68,2,FALSE))","v":""},{"$f":"IF(G14=\"\",\"\",SUM(Q57))","v":""},{"$f":"IF(H14=\"\",\"\",$O$2&\" Credit Card expense \"&Q15)","v":""}]
["EBGJ",3,"","2017/18","",{"$f":"IF(H13=\"\",\"\",\"EBO\"&\"9410\")","v":""},{"$f":"IF(F15=\"\",\"\",VLOOKUP(O3,Data!$A$38:$B$68,2,FALSE))","v":""},{"$f":"IF(G15=\"\",\"\",-SUM(Q57))","v":""},{"$f":"IF(H15=\"\",\"\",$O$2&\" Credit Card expense \"&Q15)","v":""},null,"Expenditure - Credit Card"]
{"$rows_left_out":43}
{"sheet":"Data","index":5,"n_rows":414,"n_cols":32,"rows_kept":414,"cut":false,"hidden":true,"merged":[[0,0,0,1],[0,3,0,5],[0,17,0,18],[0,20,0,21]]}
["Location Codes",null,null,"Period",null,null,null,"Group","Code","Description","Count","Secruity","Approver 1\n£0.00\nto\n£1000.00","Approver 2\n£1000.01\nto\n£10000.00","Approver 3\n£10000.01\nto\n£50,000","Approver 4\n£50000.01\nto\ninfinity",null,"New Nominal",null,null,"New Account",null,null,"New Nominal",null,null,null,null,"New Account"]
[null,null,null,"Fin. Period","Calendar Mth"]
["ACS","Alderman Cogan's Church of England Primary Academy",null,9,"01","September",null,"ADMIN","ADM001","Administration",{"$f":"COUNTIF(I:I,I3)","v":1},"A_ADMIN","Headteacher","Executive Headteacher","FD","CEO",null,1000," GAG Funding Pupil Lead",null,"ADM001","Administration",null,"1000 - GAG Funding Pupil Lead",{"$f":"--ISNUMBER(IFERROR(SEARCH('Cash & Cheque Income'!$P$8,X3,1),\"\"))","v":1},{"$f":"IF(Y3=1,COUNTIF(Y$3:$Y3,1),\"\")","v":1},{"$f":"IFERROR(INDEX($X$3:$X$274,MATCH(ROWS(Z$3:$Z3),$Z$3:$Z$274,0)),\"\")","v":"1000 - GAG Funding Pupil Lead"},null,{"$f":"$I3&\" - \"&$J3","v":"ADM001 - Administration"},{"$f":"--ISNUMBER(IFERROR(SEARCH('Cash & Cheque Income'!$P$9,AC3,1),\"\"))","v":1},{"$f":"IF(AD3=1,COUNTIF($AD$3:AD3,1),\"\")","v":1},{"$f":"IFERROR(INDEX($AC$3:$AC$55,MATCH(ROWS($AE$3:AE3),$AE$3:$AE$55,0)),\"\")","v":"ADM001 - Administration"}]
["BBS","Brotherton and Byram Primary Academy",null,10,"02","October",null,"CURR","ART001","Art",1,{"$f":"\"A_\"&MID(I4,1,3)","v":"A_ART"},"Headteacher","Executive Headteacher","FD","CEO",null,1001," Educational Services Grant",null,"ART001","Art",null,"1001 - Educational Services Grant",{"$f":"--ISNUMBER(IFERROR(SEARCH('Cash & Cheque Income'!$P$8,X4,1),\"\"))","v":1},{"$f":"IF(Y4=1,COUNTIF(Y$3:$Y4,1),\"\")","v":2},{"$f":"IFERROR(INDEX($X$3:$X$274,MATCH(ROWS(Z$3:$Z4),$Z$3:$Z$274,0)),\"\")","v":"1001 - Educational Services Grant"},null,{"$f":"$I4&\" - \"&$J4","v":"ART001 - Art"},{"$f":"--ISNUMBER(IFERROR(SEARCH('Cash & Cheque Income'!$P$9,AC4,1),\"\"))","v":1},{"$f":"IF(AD4=1,COUNTIF($AD$3:AD4,1),\"\")","v":2},{"$f":"IFERROR(INDEX($AC$3:$AC$55,MATCH(ROWS($AE$3:AE4),$AE$3:$AE$55,0)),\"\")","v":"ART001 - Art"}]
["CAM","Camblesforth Community Primary Academy",null,11,"03","November",null,"WAC","ASC001","After School Club",1,"A_WAC","Headteacher","Executive Headteacher","FD","CEO",null,1002," High Needs Funding",null,"ASC001","After School Club",null,"1002 - High Needs Funding",{"$f":"--ISNUMBER(IFERROR(SEARCH('Cash & Cheque Income'!$P$8,X5,1),\"\"))","v":1},{"$f":"IF(Y5=1,COUNTIF(Y$3:$Y5,1),\"\")","v":3},{"$f":"IFERROR(INDEX($X$3:$X$274,MATCH(ROWS(Z$3:$Z5),$Z$3:$Z$274,0)),\"\")","v":"1002 - High Needs Funding"},null,"ASC001 - After School Club",{"$f":"--ISNUMBER(IFERROR(SEARCH('Cash & Cheque Income'!$P$9,AC5,1),\"\"))","v":1},{"$f":"IF(AD5=1,COUNTIF($AD$3:AD5,1),\"\")","v":3},{"$f":"IFERROR(INDEX($AC$3:$AC$55,MATCH(ROWS($AE$3:AE5),$AE$3:$AE$55,0)),\"\")","v":"ASC001 - After School Club"}]
["EAS","Easington CE Primary Academy",null,12,"04","December",null,"CURR","ASS001","Assessment",1,"A_WAC","Headteacher","Executive Headteacher","FD","CEO",null,1004," Infant Class Size Funding",null,"ASS001","Assessment",null,"1004 - Infant Class Size Funding",{"$f":"--ISNUMBER(IFERROR(SEARCH('Cash & Cheque Income'!$P$8,X6,1),\"\"))","v":1},{"$f":"IF(Y6=1,COUNTIF(Y$3:$Y6,1),\"\")","v":4},{"$f":"IFERROR(INDEX($X$3:$X$274,MATCH(ROWS(Z$3:$Z6),$Z$3:$Z$274,0)),\"\")","v":"1004 - Infant Class Size Funding"},null,"ASS001 - Assessment",{"$f":"--ISNUMBER(IFERROR(SEARCH('Cash & Cheque Income'!$P$9,AC6,1),\"\"))","v":1},{"$f":"IF(AD6=1,COUNTIF($AD$3:AD6,1),\"\")","v":4},{"$f":"IFERROR(INDEX($AC$3:$AC$55,MATCH(ROWS($AE$3:AE6),$AE$3:$AE$55,0)),\"\")","v":"ASS001 - Assessment"}]
["EBO","Ebor Academy Trust",null,1,"05","January",null,"CURR","BEH001","Behaviour Support",{"$f":"COUNTIF(I:I,I7)","v":1},"A_WAC","Headteacher","Executive Headteacher","FD","CEO",null,1005," Free School Meals",null,"BEH001","Behaviour Support",null,"1005 - Free School Meals",{"$f":"--ISNUMBER(IFERROR(SEARCH('Cash & Cheque Income'!$P$8,X7,1),\"\"))","v":1},{"$f":"IF(Y7=1,COUNTIF(Y$3:$Y7,1),\"\")","v":5},{"$f":"IFERROR(INDEX($X$3:$X$274,MATCH(ROWS(Z$3:$Z7),$Z$3:$Z$274,0)),\"\")","v":"1005 - Free School Meals"},null,{"$f":"$I7&\" - \"&$J7","v":"BEH001 - Behaviour Support"},{"$f":"--ISNUMBER(IFERROR(SEARCH('Cash & Cheque Income'!$P$9,AC7,1),\"\"))","v":1},{"$f":"IF(AD7=1,COUNTIF($AD$3:AD7,1),\"\")","v":5},{"$f":"IFERROR(INDEX($AC$3:$AC$55,MATCH(ROWS($AE$3:AE7),$AE$3:$AE$55,0)),\"\")","v":"BEH001 - Behaviour Support"}]
["FLY","Ebor Academy Filey",null,2,"06","February",null,"WAC","BRE001","Breakfast Club",1,"A_WAC","Headteacher","Executive Headteacher","FD","CEO",null,1006," RPA Contribution",null,"BRE001","Breakfast Club",null,"1006 - RPA Contribution",{"$f":"--ISNUMBER(IFERROR(SEARCH('Cash & Cheque Income'!$P$8,X8,1),\"\"))","v":1},{"$f":"IF(Y8=1,COUNTIF(Y$3:$Y8,1),\"\")","v":6},{"$f":"IFERROR(INDEX($X$3:$X$274,MATCH(ROWS(Z$3:$Z8),$Z$3:$Z$274,0)),\"\")","v":"1006 - RPA Contribution"},null,"BRE001 - Breakfast Club",{"$f":"--ISNUMBER(IFERROR(SEARCH('Cash & Cheque Income'!$P$9,AC8,1),\"\"))","v":1},{"$f":"IF(AD8=1,COUNTIF($AD$3:AD8,1),\"\")","v":6},{"$f":"IFERROR(INDEX($AC$3:$AC$55,MATCH(ROWS($AE$3:AE8),$AE$3:$AE$55,0)),\"\")","v":"BRE001 - Breakfast Club"}]
["HMO","Hob Moor Oaks Academy",null,3,"07","March",null,"CURR","BUS001","Business Studies",1,{"$f":"\"A_\"&MID(I9,1,3)","v":"A_BUS"},"Headteacher","Executive Headteacher","FD","CEO",null,1007," Minimum Funding Guarantee",null,"BUS001","Business Studies",null,"1007 - Minimum Funding Guarantee",{"$f":"--ISNUMBER(IFERROR(SEARCH('Cash & Cheque Income'!$P$8,X9,1),\"\"))","v":1},{"$f":"IF(Y9=1,COUNTIF(Y$3:$Y9,1),\"\")","v":7},{"$f":"IFERROR(INDEX($X$3:$X$274,MATCH(ROWS(Z$3:$Z9),$Z$3:$Z$274,0)),\"\")","v":"1007 - Minimum Funding Guarantee"},null,"BUS001 - Business Studies",{"$f":"--ISNUMBER(IFERROR(SEARCH('Cash & Cheque Income'!$P$9,AC9,1),\"\"))","v":1},{"$f":"IF(AD9=1,COUNTIF($AD$3:AD9,1),\"\")","v":7},{"$f":"IFERROR(INDEX($AC$3:$AC$55,MATCH(ROWS($AE$3:AE9),$AE$3:$AE$55,0)),\"\")","v":"BUS001 - Business Studies"}]
["HMS","Hob Moor Primary Academy",null,4,"08","April",null,"CAP","CAP001","Capital",1,"A_CAP","Headteacher","Executive Headteacher","FD","CEO",null,1008," Lump Sum Funding",null,"CAP001","Capital",null,"1008 - Lump Sum Funding",{"$f":"--ISNUMBER(IFERROR(SEARCH('Cash & Cheque Income'!$P$8,X10,1),\"\"))","v":1},{"$f":"IF(Y10=1,COUNTIF(Y$3:$Y10,1),\"\")","v":8},{"$f":"IFERROR(INDEX($X$3:$X$274,MATCH(ROWS(Z$3:$Z10),$Z$3:$Z$274,0)),\"\")","v":"1008 - Lump Sum Funding"},null,"CAP001 - Capital",{"$f":"--ISNUMBER(IFERROR(SEARCH('Cash & Cheque Income'!$P$9,AC10,1),\"\"))","v":1},{"$f":"IF(AD10=1,COUNTIF($AD$3:AD10,1),\"\")","v":8},{"$f":"IFERROR(INDEX($AC$3:$AC$55,MATCH(ROWS($AE$3:AE10),$AE$3:$AE$55,0)),\"\")","v":"CAP001 - Capital"}]
["HRS","Haxby Road Primary Academy",null,5,"09","May",null,"CAT","CAT001","Catering",1,"A_CAT","Headteacher","Executive Headteacher","FD","CEO",null,1051," PE Grant",null,"CAT001","Catering",null,"1051 - PE Grant",{"$f":"--ISNUMBER(IFERROR(SEARCH('Cash & Cheque Income'!$P$8,X11,1),\"\"))","v":1},{"$f":"IF(Y11=1,COUNTIF(Y$3:$Y11,1),\"\")","v":9},{"$f":"IFERROR(INDEX($X$3:$X$274,MATCH(ROWS(Z$3:$Z11),$Z$3:$Z$274,0)),\"\")","v":"1051 - PE Grant"},null,"CAT001 - Catering",{"$f":"--ISNUMBER(IFERROR(SEARCH('Cash & Cheque Income'!$P$9,AC11,1),\"\"))","v":1},{"$f":"IF(AD11=1,COUNTIF($AD$3:AD11,1),\"\")","v":9},{"$f":"IFERROR(INDEX($AC$3:$AC$55,MATCH(ROWS($AE$3:AE11),$AE$3:$AE$55,0)),\"\")","v":"CAT001 - Catering"}]
["MAR","Marfleet Primary Academy",null,6,"10","June",null,"CURR","COO001","Cook School",1,{"$f":"\"A_\"&MID(I12,1,3)","v":"A_COO"},"Headteacher","Executive Headteacher","FD","CEO",null,1052," LACSEG",null,"COO001","Cook School",null,"1052 - LACSEG",{"$f":"--ISNUMBER(IFERROR(SEARCH('Cash & Cheque Income'!$P$8,X12,1),\"\"))","v":1},{"$f":"IF(Y12=1,COUNTIF(Y$3:$Y12,1),\"\")","v":10},{"$f":"IFERROR(INDEX($X$3:$X$274,MATCH(ROWS(Z$3:$Z12),$Z$3:$Z$274,0)),\"\")","v":"1052 - LACSEG"},null,"COO001 - Cook School",{"$f":"--ISNUMBER(IFERROR(SEARCH('Cash & Cheque Income'!$P$9,AC12,1),\"\"))","v":1},{"$f":"IF(AD12=1,COUNTIF($AD$3:AD12,1),\"\")","v":10},{"$f":"IFERROR(INDEX($AC$3:$AC$55,MATCH(ROWS($AE$3:AE12),$AE$3:$AE$55,0)),\"\")","v":"COO001 - Cook School"}]
["PAT","Patrington CE Primary Academy",null,7,"11","July",null,"CURR","DAT001","Design and Technology",1,"A_DAT","Headteacher","Executive Headteacher","FD","CEO",null,1053," Insurance",null,"CPD001","Staff Development",null,"1053 - Insurance",{"$f":"--ISNUMBER(IFERROR(SEARCH('Cash & Cheque Income'!$P$8,X13,1),\"\"))","v":1},{"$f":"IF(Y13=1,COUNTIF(Y$3:$Y13,1),\"\")","v":11},{"$f":"IFERROR(INDEX($X$3:$X$274,MATCH(ROWS(Z$3:$Z13),$Z$3:$Z$274,0)),\"\")","v":"1053 - Insurance"},null,"CPD001 - Staff Development",{"$f":"--ISNUMBER(IFERROR(SEARCH('Cash & Cheque Income'!$P$9,AC13,1),\"\"))","v":1},{"$f":"IF(AD13=1,COUNTIF($AD$3:AD13,1),\"\")","v":11},{"$f":"IFERROR(INDEX($AC$3:$AC$55,MATCH(ROWS($AE$3:AE13),$AE$3:$AE$55,0)),\"\")","v":"CPD001 - Staff Development"}]
["PGS","Park Grove Primary Academy",null,8,"12","August",null,"CURR","DRA001","Drama",1,"A_DRA","Headteacher","Executive Headteacher","FD","CEO",null,1054," Teacher Threshold",null,"DAT001","Design and Technology",null,"1054 - Teacher Threshold",{"$f":"--ISNUMBER(IFERROR(SEARCH('Cash & Cheque Income'!$P$8,X14,1),\"\"))","v":1},{"$f":"IF(Y14=1,COUNTIF(Y$3:$Y14,1),\"\")","v":12},{"$f":"IFERROR(INDEX($X$3:$X$274,MATCH(ROWS(Z$3:$Z14),$Z$3:$Z$274,0)),\"\")","v":"1054 - Teacher Threshold"},null,{"$f":"$I13&\" - \"&$J13","v":"DAT001 - Design and Technology"},{"$f":"--ISNUMBER(IFERROR(SEARCH('Cash & Cheque Income'!$P$9,AC14,1),\"\"))","v":1},{"$f":"IF(AD14=1,COUNTIF($AD$3:AD14,1),\"\")","v":12},{"$f":"IFERROR(INDEX($AC$3:$AC$55,MATCH(ROWS($AE$3:AE14),$AE$3:$AE$55,0)),\"\")","v":"DAT001 - Design and Technology"}]
["RWS","Robert Wilkinson Primary Academy",null,null,null,null,null,"CURR","DUK001","Duke of Edinburgh Award Scheme",1,"A_DUK","Headteacher","Executive Headteacher","FD","CEO",null,1081," Pupil Premium",null,"DRA001","Drama",null,"1081 - Pupil Premium",{"$f":"--ISNUMBER(IFERROR(SEARCH('Cash & Cheque Income'!$P$8,X15,1),\"\"))","v":1},{"$f":"IF(Y15=1,COUNTIF(Y$3:$Y15,1),\"\")","v":13},{"$f":"IFERROR(INDEX($X$3:$X$274,MATCH(ROWS(Z$3:$Z15),$Z$3:$Z$274,0)),\"\")","v":"1081 - Pupil Premium"},null,"DRA001 - Drama",{"$f":"--ISNUMBER(IFERROR(SEARCH('Cash & Cheque Income'!$P$9,AC15,1),\"\"))","v":1},{"$f":"IF(AD15=1,COUNTIF($AD$3:AD15,1),\"\")","v":13},{"$f":"IFERROR(INDEX($AC$3:$AC$55,MATCH(ROWS($AE$3:AE15),$AE$3:$AE$55,0)),\"\")","v":"DRA001 - Drama"}]
{"$rows_left_out":399}